{"text_format":"1","workbook":"xlsx","n_sheets":4,"sheets":["Cálculo de CRC","Instrucciones","Dudas frecuentes","Tablas origen datos"],"not_rendered":{"charts":0,"images":3,"macros":1,"external_links":0,"defined_names":13,"comments":0,"pivot_tables":0},"unopened":[],"bounds":{"document_bytes":16777216,"sheet_cells":100000,"rows_first":2000,"rows_last":500,"rows_between":2000,"halvings":0,"cell_chars":16384,"cell_head_chars":4096},"cells_cut":0,"cells_raw":0,"read":"whole","date_system":"1900"}

{"sheet":"Cálculo de CRC","index":0,"n_rows":70,"n_cols":9,"rows_kept":70,"cut":false,"hidden":false,"merged":[[24,8,26,8],[37,1,37,2],[36,4,38,4],[36,5,38,5],[36,6,38,6],[25,1,25,2],[28,6,30,6],[24,5,26,5],[28,5,30,5],[28,4,30,4],[24,4,26,4],[24,1,24,2],[11,2,11,8],[12,2,12,8],[13,2,13,8],[20,6,22,6],[20,8,22,8],[20,4,22,4],[21,1,21,2],[22,1,22,2],[20,7,21,7],[20,1,20,2],[18,4,18,7],[20,5,22,5],[17,8,18,8],[17,1,18,3],[17,4,17,7],[5,3,5,8],[57,1,57,8],[42,5,42,6],[55,2,55,8],[33,1,33,2],[34,1,34,2],[19,1,19,2],[15,1,15,2],[26,1,26,2],[28,1,28,2],[29,1,29,2],[30,1,30,2],[32,1,32,2],[24,6,26,6],[24,7,25,7],[10,2,10,8],[54,2,54,8],[28,8,30,8],[32,8,34,8],[32,6,34,6],[32,5,34,5],[32,4,34,4],[41,1,44,2],[36,1,36,2],[28,7,29,7],[32,7,33,7],[36,8,38,8],[38,1,38,2],[36,7,37,7],[45,6,45,8],[44,5,44,6],[42,7,42,8],[48,8,50,8],[49,1,49,2],[50,1,50,2],[48,7,50,7],[48,4,50,5],[47,4,47,5],[47,1,47,2],[46,1,46,4],[48,1,48,2],[48,6,50,6]]}
[]
[]
[]
[]
[]
[null,null,null,"COSTES DE REFERENCIA DE LA CONSTRUCCIÓN (CRC)\nY RESUMEN DE SUPERFICIES"]
[]
[]
[]
[null,"Datos de proyecto"]
[null,"Obra"]
[null,"Emplazamiento "]
[null,"Promotor"]
[null,"Arquitecto/as"]
[]
[null,"Cálculo CRC"]
[]
[null,"Módulo COACYLE   M    (€ / m2)",null,null,"Seleccione provincia",null,null,null,{"$f":"VLOOKUP(E19,'Tablas origen datos'!B159:C1399,2,0)","v":0}]
[null,null,null,null,"Seleccione municipio"]
[null,"Tipo de uso",null,null,"Ct","Tipo de intervención","Ci","Superficie \nconstruida S","M x Ct x Ci x S"]
[null,"Seleccione grupo",null,{"$f":"VLOOKUP(B21,'Tablas origen datos'!B13:C23,2,0)","v":0},{"$f":"VLOOKUP(B23,'Tablas origen datos'!B64:D133,3,0)","v":0},"Rehabilitación completa (no estructural)",{"$f":"VLOOKUP(F21,'Tablas origen datos'!B139:C144,2,0)","v":0.92},0,{"$f":"H21*G21*E21*I18","v":0}]
[null,"Seleccione nivel",null,{"$f":"VLOOKUP(B22,'Tablas origen datos'!B28:D59,3,0)","v":0}]
[null,"Seleccione tipología",null,null,null,null,null,{"$f":"IFERROR(H21/H41, 0)","v":0}]
[]
[null,"Seleccione grupo",null,{"$f":"VLOOKUP(B25,'Tablas origen datos'!B13:C23,2,0)","v":0},{"$f":"VLOOKUP(B27,'Tablas origen datos'!B64:D133,3,0)","v":0},"Seleccione tipo de intervención",{"$f":"VLOOKUP(F25,'Tablas origen datos'!B139:C144,2,0)","v":0},0,{"$f":"H25*G25*E25*I18","v":0}]
[null,"Seleccione nivel",null,{"$f":"VLOOKUP(B26,'Tablas origen datos'!B28:D59,3,0)","v":0}]
[null,"Seleccione tipología",null,null,null,null,null,{"$f":"IFERROR(H25/H41,0)","v":0}]
[]
[null,"Seleccione grupo",null,{"$f":"VLOOKUP(B29,'Tablas origen datos'!B13:C23,2,0)","v":0},{"$f":"VLOOKUP(B31,'Tablas origen datos'!B64:D133,3,0)","v":0},"Seleccione tipo de intervención",{"$f":"VLOOKUP(F29,'Tablas origen datos'!B139:C144,2,0)","v":0},0,{"$f":"H29*G29*E29*I18","v":0}]
[null,"Seleccione nivel",null,{"$f":"VLOOKUP(B30,'Tablas origen datos'!B28:D59,3,0)","v":0}]
[null,"Seleccione tipología",null,null,null,null,null,{"$f":"IFERROR(H29/H41,0)","v":0}]
[]
[null,"Seleccione grupo",null,{"$f":"VLOOKUP(B33,'Tablas origen datos'!B13:C23,2,0)","v":0},{"$f":"VLOOKUP(B35,'Tablas origen datos'!B64:D133,3,0)","v":0},"Seleccione tipo de intervención",{"$f":"VLOOKUP(F33,'Tablas origen datos'!B139:C144,2,0)","v":0},0,{"$f":"H33*G33*E33*I18","v":0}]
[null,"Seleccione nivel",null,{"$f":"VLOOKUP(B34,'Tablas origen datos'!B28:D59,3,0)","v":0}]
[null,"Seleccione tipología",null,null,null,null,null,{"$f":"IFERROR(H33/H41,0)","v":0}]
[]
[null,"Seleccione grupo",null,{"$f":"VLOOKUP(B37,'Tablas origen datos'!B13:C23,2,0)","v":0},{"$f":"VLOOKUP(B39,'Tablas origen datos'!B64:D133,3,0)","v":0},"Seleccione tipo de intervención",{"$f":"VLOOKUP(F37,'Tablas origen datos'!B139:C144,2,0)","v":0},0,{"$f":"H37*G37*E37*I18","v":0}]
[null,"Seleccione nivel",null,{"$f":"VLOOKUP(B38,'Tablas origen datos'!B28:D59,3,0)","v":0}]
[null,"Seleccione tipología",null,null,null,null,null,{"$f":"IFERROR(H37/H41,0)","v":0}]
[]
[null,"Observaciones",null,null,null,"Suma de superficies",null,{"$f":"H21+H25+H29+H33+H37","v":0}]
[]
[null,null,null,null,null,"CRC",null,{"$f":"SUM(I21+I25+I29+I33+I37)","v":0}]
[]
[null,null,null,null,null,"PEM proyecto \n(sin gastos generales ni beneficio industrial)",null,null,0]
[null,null,null,null,null,"Aviso COACYLE",{"$f":"IF((H43>I45),\"PEM inferior a referencia\", \"PEM superior a referencia\")","v":"PEM superior a referencia"}]
[null,"Otras intervenciones no contempladas en CRC\n(sustitución puntual estructural, cambios en fachadas, ascensores, demoliciones, etc.)"]
[null,"Tipo de uso",null,null,"Intervención \nno contemplada",null,"Superficie equivalente","Superficie construida","PEM otras intervenciones"]
[null,"Seleccione grupo",null,{"$f":"VLOOKUP(B49,'Tablas origen datos'!B13:C23,2,0)","v":0},null,null,{"$f":"I49/500","v":0},0,0]
[null,"Seleccione nivel",null,{"$f":"VLOOKUP(B50,'Tablas origen datos'!B28:D59,3,0)","v":0}]
[null,"Seleccione tipología"]
[]
[null,null,null,null,null,"TOTAL superficies",null,{"$f":"H41+H49","v":0}]
[]
[null,"En"]
[null,"Firma"]
[]
[null,"De acuerdo con lo establecido en la normativa vigente en materia de Protección de Datos de carácter personal, le informamos de que el COLEGIO OFICIAL DE ARQUITECTOS DE CASTILLA Y LEON ESTE, COACYLE es el responsable del tratamiento de los datos, con la finalidad de gestionar su relación con el colegio y su condición de colegiado. La legitimación de este tratamiento de datos reside en la ejecución de la prestación de un servicio y cumplimiento de una obligación legal que nos asiste como responsables. No se comunicarán sus datos a terceros salvo obligación legal. En caso de producirse alguna modificación en sus datos, le rogamos nos lo comunique debidamente. Tiene derecho a acceder, rectificar y suprimir los datos, así como otros derechos, como se explica en la información adicional, que encontrará disponible en la Política de privacidad de nuestra página web: www.coacyle.com. Para el ejercicio de sus derechos de acceso, rectificación o supresión, limitación de su tratamiento, portabilidad y/u oposición, podrá dirigirse al responsable del tratamiento: COLEGIO OFICIAL DE ARQUITECTOS DE CASTILLA Y LEÓN ESTE (Ref. Protección de Datos), C/ Miguel Íscar 17 – 2º Dcha., 47001 Valladolid. Delegado de Protección de Datos: dpd@data-consulting.es. Nota importante: En los supuestos en los que se deban incluir datos de carácter personal, referentes a terceras personas físicas, en cualquiera de los formularios, se las deberá, con carácter previo a su inclusión, informar de la cesión de sus datos de carácter personal al COACYLE y al Consejo Superior de Arquitectos."]
[]
[]
[]
[]
[]
[]
[]
[]
[]
[]
[]
[null,"Es posible consultar las dudas en la dirección email cat@coacyle.com"]

{"sheet":"Instrucciones","index":1,"n_rows":41,"n_cols":4,"rows_kept":41,"cut":false,"hidden":false,"merged":[[28,3,28,11],[27,3,27,11],[13,3,13,11],[19,3,19,11],[20,3,20,11],[21,3,21,11],[15,3,15,11]]}
[]
[]
[]
[]
[]
[]
[]
[]
[]
[]
[]
[null,null,null,"INSTRUCCIONES PARA RELLENAR EL FORMULARIO"]
[]
[null,null,null,"Las celdas que figuran en rojo son las celdas mínimas a rellenar para que se produzca el cálculo de CRC. También es necesario rellenar las celdas que están sombreadas en gris, con los datos de proyecto. Las celdas en blanco se rellenarán automáticamente. "]
[]
[null,null,0,"Habilite las macros del documento"]
[]
[]
[]
[null,null,1,"Indique los datos de proyecto"]
[null,null,2,"Seleccione el módulo, indicando la provincia y el municipio."]
[null,null,3,"Indique tipo de uso. Se pueden indicar hasta 5 usos diferentes. Para ello, seleccione primero el desplegable \"Grupo\", después \"Nivel\" y finalmente \"Tipología\". Automáticamente aparecerá el Ct correspondiente."]
[null,null,4,"Indique tipo de intervención. Automáticamente aparecerá el Ci correspondiente."]
[null,null,5,"Indique la superficie construida"]
[null,null,6,"Introduzca observaciones si lo cree necesario, para aclarar los datos introducidos"]
[null,null,7,"Introduzca PEM del proyecto (sin gastos generales ni beneficio industrial). "]
[null,null,8,"Indique el lugar y firme el documento"]
[null,null,null,"El aviso de COACYLE expresa si el PEM del proyecto está por debajo del Coste de Referencia de la Construcción. Este aviso es informativo y no implicará la denegación del visado. "]
[null,null,null,"Cuando la intervención no se ajuste a la especificada en los desplegables, se rellenará el apartado \"Otras intervenciones no contemplados en CRC\". Al rellenar este campo, no es necesario especificar ni el Módulo, ni el tipo de intervención. Se indicará el uso con el desplegable, se tecleará la intervención no comtemplada, la superficie construida y el PEM (sin gastos generales ni beneficio industrial). "]
[]
[]
[]
[]
[]
[]
[]
[]
[]
[]
[]
[null,null,null,"Es posible consultar las  dudas en la dirección email cat@coacyle.com"]

{"sheet":"Dudas frecuentes","index":2,"n_rows":42,"n_cols":4,"rows_kept":42,"cut":false,"hidden":false,"merged":[[29,3,29,11],[32,3,32,11],[35,3,35,11],[17,3,17,11],[14,3,15,11],[20,3,20,11],[23,3,23,11],[26,3,26,11]]}
[]
[]
[]
[]
[]
[]
[]
[]
[]
[]
[]
[null,null,null,"DUDAS FRECUENTES "]
[]
[null,null,null,"¿Es obligatorio rellenar este impreso para visar?"]
[null,null,null,"Sí, deberá entregarse junto con la solicitud de visado."]
[]
[null,null,null,"¿Se denegará el visado si el PEM de proyecto es inferior a  el CRC?"]
[null,null,null,"No se denegará el visado, tan solo se informa de que el PEM es inferior o superior al CRC."]
[]
[null,null,null,"¿Qué superficie construida se toma para aplicar el CRC?"]
[null,null,null,"Se utilizará la superficie construida sobre la que se lleva a cabo la intervención. Si se trata de obra nueva, se utilizará la superficie construida total. Si se trata de la reforma de una vivienda, se aplicará la superficie construida donde se interviene. Si se trata de una ampliación, se utilizará la superficie de la ampliación. "]
[]
[null,null,null,"¿Qué se entiende por superficie construida?"]
[null,null,null,"Se entiende por superficie construida la delimitada por las líneas exteriores de cada una de las plantas que tengan un USO POSIBLE. Los balcones o terrazas y las superficies cubiertas no cerradas (porches abiertos o plantas diáfanas) se computarán por el 50% de su superficie. "]
[]
[null,null,null,"¿Qué ocurre en el caso de las ampliaciones o elevaciones de las construcciones?"]
[null,null,null,"El presupuesto de referencia se calculará de igual forma que la señalada anteriormente, considerando las características de todo el conjunto y aplicando el valor del metro cuadrado obtenido a la superficie construida que se amplía. "]
[]
[null,null,null,"¿Cómo hago el CRC si en mi edificio hay diferentes usos?"]
[null,null,null,"Cuando en una misma edificación existan usos que estén comprendidos en más de uno de los grupos que se definen, el presupuesto de referencia se obtendrá sumando los resultados de multiplicar la superficie construida de cada uso por los costes del metro cuadrado obtenidos de cada uno de ellos. "]
[]
[null,null,null,"¿Qué ocurre en el caso de los usos no contemplados en las tablas CRC?"]
[null,null,null,"Si el uso o la tipología del edificio no figura en esta documentación, se puede tratar de asemejar el uso no disponible a otro uso que sí que figure en este listado, cuyas características puedan corresponderse."]
[]
[null,null,null,"Mi proyecto es una intervención que no figura en el desplegable de intervenciones. ¿Qué hago?"]
[null,null,null,"Cuando la intervención no figura en el desplegable de intervenciones, por tratarse por ejemplo de la sustitución de un pilar, de cambios en fachada, de una demolición, de la instalación de un ascensor, se deberá utilizar el apartado \"otras intervenciones no contempladas en CRC\". Se indicará el uso en el desplegable, se tecleará la intervención, así como la superficie y el PEM (sin gastos generales ni beneficio industrial). "]
[]
[]
[]
[]
[]
[null,null,null,"Es posible consultar las dudas en la dirección email cat@coacyle.com"]

{"sheet":"Tablas origen datos","index":3,"n_rows":1399,"n_cols":4,"rows_kept":1399,"cut":false,"hidden":true,"merged":[]}
[]
[]
["Módulo"]
["id","nombre","valor"]
[0,"Seleccione módulo",0]
[1,"Poblaciones de más de 20.000 habitantes",650]
[2,"Poblaciones de menos de 20.000 habitantes",600]
[]
[]
[]
["Grupo"]
["id","valor"]
[0,"Seleccione grupo",0]
[1,"Residencial",1]
[2,"Industrial ",2]
[3,"Oficinas",3]
[4,"Comercial",4]
[5,"Deportes",5]
[6,"Espectáculos",6]
[7,"Ocio y Hostelería",7]
[8,"Sanidad y beneficencia",8]
[9,"Culturales y religiosos",9]
[10,"Edificios singulares",10]
[]
[]
["Nivel"]
["id","valor","idgrupo ","id"]
[0,"Seleccione nivel",0,0]
[1,"Viviendas colectivas de carácter urbano",1,1]
[2,"Viviendas unifamiliares de carácter urbano",1,2]
[3,"Edificación rural",1,3]
[4,"Naves de fabricación y almacenamiento",2,4]
[5,"Garajes y aparcamientos",2,5]
[6,"Servicios de transporte",2,6]
[7,"Edificio exclusivo",3,7]
[8,"Edificio mixto",3,8]
[9,"Banca y seguros",3,9]
[10,"Comercios en edificio mixto",4,10]
[11,"Comercios en edificio exclusivo",4,11]
[12,"Mercados y supermercados",4,12]
[13,"Cubiertos",5,13]
[14,"Descubiertos",5,14]
[15,"Auxiliares",5,15]
[16,"Espectáculos deportivos",5,16]
[17,"Varios",6,17]
[18,"Bares musicales, salas de fiestas, discotecas",6,18]
[19,"Cines y teatros",6,19]
[20,"Con residencia",7,20]
[21,"Sin residencia",7,21]
[22,"Exposiciones y reuniones",7,22]
[23,"Sanitarios con camas",8,23]
[24,"Sanitarios varios",8,24]
[25,"Benéficos y asistencia",8,25]
[26,"Culturales con residencia",9,26]
[27,"Culturales sin residencia",9,27]
[28,"Religiosos",9,28]
[29,"Histórico-artísticos",10,29]
[30,"De carácter oficial",10,30]
[31,"De carácter especial",10,31]
[]
[]
["Tipología"]
["id","valor","idnivel","coeficiente"]
[0,"Seleccione tipología",0,0]
[1,"Edificación abierta",1,1.05]
[2,"En manzana cerrada",1,1]
[3,"Garajes, trasteros y locales en estructura",1,0.53]
[4,"Edificación aislada o pareada",2,1.25]
[5,"En linea o manzana cerrada",2,1.1499999999999999]
[6,"Garajes y porches en PB (garajes, trasteros y anexos)",2,0.65]
[8,"Anexos",3,0.45]
[9,"Fabricación en una planta",4,0.6]
[10,"Fabricación en varias plantas",4,0.7]
[11,"Almacenamiento",4,0.5]
[12,"Garajes",5,0.7]
[13,"Aparcamientos",5,0.4]
[14,"Estaciones de servicio",6,1.25]
[15,"Estaciones",6,1.8]
[16,"Oficinas múltiples",7,1.5]
[17,"Oficinas unitarias",7,1.6]
[18,"Unido a viviendas",8,1.3]
[19,"Unido a industria",8,1]
[20,"En edificio exclusivo",9,2.1]
[21,"En edificio mixto",9,1.9]
[22,"Locales comerciales y talleres",10,1.2]
[23,"Galerías comerciales",10,1.3]
[24,"En una planta",11,1.6]
[25,"En varias plantas",11,1.75]
[26,"Mercados",12,1.45]
[27,"Hipermercados y supermercados",12,1.3]
[28,"Deportes varios cubiertos",13,1.5]
[29,"Piscinas cubiertas",13,1.65]
[30,"Deportes varios descubiertos",14,0.45]
[31,"Piscinas descubiertas",14,0.6]
[32,"Vestuarios, depuradoras, calefacción, etc.",15,1.05]
[33,"Estadios, plazas de toros",16,1.7]
[34,"Hipódromos, canódromos, velódromos, etc.",16,1.55]
[35,"Cubiertos",17,1.35]
[36,"Descubiertos",17,0.55000000000000004]
[37,"En edificio exclusivo",18,1.9]
[38,"Unido a otros usos",18,1.55]
[39,"Cines",19,1.8]
[40,"Teatros",19,1.9]
[41,"Hoteles, hostales, moteles",20,1.9]
[42,"Aparthoteles, bungalows",20,2.0499999999999998]
[43,"Restaurantes",21,1.75]
[44,"Bares y cafeterías",21,1.5]
[45,"Casinos y clubs sociales",22,1.9]
[46,"Exposiciones y congresos",22,1.8]
[47,"Sanatorios y clínicas",23,2.25]
[48,"Hospitales",23,2.15]
[49,"Ambulatorios y consultorios",24,1.7]
[50,"Balnearios, casas de baños",24,1.9]
[51,"Con residencia (asilos, residencias, etc.)",25,1.8]
[52,"Sin residencia (comedores, clubs, guarderías, etc.)",25,1.4]
[53,"Internados",26,1.7]
[54,"Colegios mayores",26,1.9]
[55,"Facultades, colegios, escuelas",27,1.4]
[56,"Bibliotecas y museos",27,1.65]
[57,"Conventos y centros parroquiales",28,1.25]
[58,"Iglesias y capillas",28,2]
[59,"Monumentales",29,2]
[60,"Ambientales o típicos",29,1.65]
[61,"Administrativos",30,1.6]
[62,"Representativos",30,1.75]
[63,"Penitenciarios, militares y varios",31,1.55]
[64,"Obras urbanización interior",31,0.15]
[65,"Campings",31,0.12]
[66,"Campos de golf",31,0.03]
[67,"Jardinería",31,0.11]
[68,"Silos y depósitos para sólidos (m/3)",31,0.2]
[69,"Depósitos líquidos (m/3)",31,0.28999999999999998]
[70,"Depósitos gases (m/3)",31,0.4]
[]
[]
[]
["Ci"]
["id","valor","coeficienteci"]
[0,"Seleccione tipo de intervención",0]
[1,"Obra nueva",1]
[2,"Rehabilitación completa (no estructural)",0.92]
[3,"Rehabilitación de instalaciones y acabados interiores",0.39]
[4,"Rehabilitación de acabados interiores",0.23]
[5,"Rehabilitación energética",0.15]
[]
[]
["Provincias"]
[]
["id","provincia"]
[0,"Seleccione provincia"]
[1,"Ávila"]
[2,"Burgos"]
[3,"Segovia"]
[4,"Soria"]
[5,"Valladolid"]
[]
["Módulos de Catastro por municipios"]
["id","municipio","modulo","provincia"]
[0,"Seleccione municipio"]
[1,"Albornos","500",1]
[2,"Aldeanueva de Santa Cruz","500",1]
[3,"Aldeaseca","500",1]
[4,"Amavida","500",1]
[5,"Arenas de San Pedro","600",1]
[6,"Arevalillo","500",1]
[7,"Arévalo","600",1]
[8,"Aveinte","500",1]
[9,"Avellaneda","500",1]
[10,"Ávila","700",1]
[11,"Barraco","600",1]
[12,"Barromán","500",1]
[13,"Becedas","500",1]
[14,"Becedillas","500",1]
[15,"Bercial de Zapardiel","500",1]
[16,"Bernuy-Zapardiel","500",1]
[17,"Berrocalejo de Aragona","500",1]
[18,"Blascomillán","500",1]
[19,"Blasconuño de Matacabras","500",1]
[20,"Blascosancho","500",1]
[21,"Bohoyo","550",1]
[22,"Bonilla de la Sierra","500",1]
[23,"Brabos","500",1]
[24,"Bularros","500",1]
[25,"Burgohondo","550",1]
[26,"Cabezas de Alambre","500",1]
[27,"Cabezas del Pozo","500",1]
[28,"Cabezas del Villar","500",1]
[29,"Cabizuela","500",1]
[30,"Canales","500",1]
[31,"Candeleda","600",1]
[32,"Cantiveros","500",1]
[33,"Cardeñosa","550",1]
[34,"Casas del Puerto","500",1]
[35,"Casasola","500",1]
[36,"Casavieja","600",1]
[37,"Casillas","550",1]
[38,"Castellanos de Zapardiel","500",1]
[39,"Cebreros","600",1]
[40,"Cepeda la Mora","500",1]
[41,"Chamartín","500",1]
[42,"Cillán","500",1]
[43,"Cisla","500",1]
[44,"Collado de Contreras","500",1]
[45,"Collado del Mirón","500",1]
[46,"Constanzana","500",1]
[47,"Crespos","550",1]
[48,"Cuevas del Valle","550",1]
[49,"Diego del Carpio","500",1]
[50,"Donjimeno","500",1]
[51,"Donvidas","500",1]
[52,"El Arenal","600",1]
[53,"El Barco de Ávila","600",1]
[54,"El Bohodón","500",1]
[55,"El Fresno","550",1]
[56,"El Herradón","550",1]
[57,"El Hornillo","550",1]
[58,"El Hoyo de Pinares","600",1]
[59,"El Losar del Barco","500",1]
[60,"El Mirón","500",1]
[61,"El Oso","500",1]
[62,"El Parral","500",1]
[63,"El Tiemblo","600",1]
[64,"Espinosa de los Caballeros","500",1]
[65,"Flores de Ávila","500",1]
[66,"Fontiveros","550",1]
[67,"Fresnedilla","500",1]
[68,"Fuente el Saúz","500",1]
[69,"Fuentes de Año","500",1]
[70,"Gallegos de Altamiros","500",1]
[71,"Gallegos de Sobrinos","500",1]
[72,"Garganta del Villar","500",1]
[73,"Gavilanes","550",1]
[74,"Gemuño","500",1]
[75,"Gilbuena","500",1]
[76,"Gil García","500",1]
[77,"Gimialcón","500",1]
[78,"Gotarrendura","500",1]
[79,"Grandes y San Martín","500",1]
[80,"Guisando","550",1]
[81,"Gutierre-Muñoz","500",1]
[82,"Hernansancho","500",1]
[83,"Herreros de Suso","500",1]
[84,"Higuera de las Dueñas","550",1]
[85,"Horcajo de las Torres","500",1]
[86,"Hoyocasero","500",1]
[87,"Hoyorredondo","500",1]
[88,"Hoyos de Miguel Muñoz","500",1]
[89,"Hoyos del Collado","500",1]
[90,"Hoyos del Espino","550",1]
[91,"Hurtumpascual","500",1]
[92,"Junciana","500",1]
[93,"La Adrada","600",1]
[94,"La Aldehuela","500",1]
[95,"La Carrera","500",1]
[96,"La Colilla","550",1]
[97,"La Hija de Dios","500",1]
[98,"La Horcajada","550",1]
[99,"La Serrada","550",1]
[100,"La Torre","500",1]
[101,"Langa","500",1]
[102,"Lanzahíta","550",1]
[103,"Las Berlanas","500",1]
[104,"Las Navas del Marqués","600",1]
[105,"Los Llanos de Tormes","500",1]
[106,"Madrigal de las Altas Torres","550",1]
[107,"Maello","550",1]
[108,"Malpartida de Corneja","500",1]
[109,"Mamblas","500",1]
[110,"Mancera de Arriba","500",1]
[111,"Manjabálago","500",1]
[112,"Marlín","500",1]
[113,"Martiherrero","550",1]
[114,"Martínez","500",1]
[115,"Mediana de Voltoya","550",1]
[116,"Medinilla","500",1]
[117,"Mengamuñoz","500",1]
[118,"Mesegar de Corneja","500",1]
[119,"Mijares","550",1]
[120,"Mingorría","550",1]
[121,"Mironcillo","500",1]
[122,"Mirueña de los Infanzones","500",1]
[123,"Mombeltrán","550",1]
[124,"Monsalupe","500",1]
[125,"Moraleja de Matacabras","500",1]
[126,"Muñana","550",1]
[127,"Muñico","500",1]
[128,"Muñogalindo","550",1]
[129,"Muñogrande","500",1]
[130,"Muñomer del Peco","500",1]
[131,"Muñopepe","500",1]
[132,"Muñosancho","500",1]
[133,"Muñotello","500",1]
[134,"Narrillos del Álamo","500",1]
[135,"Narrillos del Rebollar","500",1]
[136,"Narros de Saldueña","500",1]
[137,"Narros del Castillo","500",1]
[138,"Narros del Puerto","500",1]
[139,"Nava de Arévalo","500",1]
[140,"Nava del Barco","500",1]
[141,"Navacepedilla de Corneja","500",1]
[142,"Navadijos","500",1]
[143,"Navaescurial","500",1]
[144,"Navahondilla","550",1]
[145,"Navalacruz","550",1]
[146,"Navalmoral de la Sierra","550",1]
[147,"Navalonguilla","500",1]
[148,"Navalosa","500",1]
[149,"Navalperal de Pinares","600",1]
[150,"Navalperal de Tormes","500",1]
[151,"Navaluenga","600",1]
[152,"Navaquesera","500",1]
[153,"Navarredonda de Gredos","550",1]
[154,"Navarredondilla","500",1]
[155,"Navarrevisca","550",1]
[156,"Navatalgordo","500",1]
[157,"Navatejares","500",1]
[158,"Neila de San Miguel","500",1]
[159,"Niharra","500",1]
[160,"Ojos-Albos","500",1]
[161,"Orbita","500",1]
[162,"Padiernos","550",1]
[163,"Pajares de Adaja","500",1]
[164,"Palacios de Goda","550",1]
[165,"Papatrigo","500",1]
[166,"Pascualcobo","500",1]
[167,"Pedro Bernardo","600",1]
[168,"Pedro-Rodríguez","500",1]
[169,"Peguerinos","550",1]
[170,"Peñalba de Ávila","500",1]
[171,"Piedrahíta","600",1]
[172,"Piedralaves","600",1]
[173,"Poveda","500",1]
[174,"Poyales del Hoyo","550",1]
[175,"Pozanco","500",1]
[176,"Pradosegar","500",1]
[177,"Puerto Castilla","500",1]
[178,"Rasueros","500",1]
[179,"Riocabado","500",1]
[180,"Riofrío","500",1]
[181,"Rivilla de Barajas","500",1]
[182,"Salobral","550",1]
[183,"Salvadiós","500",1]
[184,"San Bartolomé de Béjar","500",1]
[185,"San Bartolomé de Corneja","500",1]
[186,"San Bartolomé de Pinares","550",1]
[187,"San Esteban de los Patos","500",1]
[188,"San Esteban de Zapardiel","500",1]
[189,"San Esteban del Valle","550",1]
[190,"San García de Ingelmos","500",1]
[191,"San Juan de Gredos","550",1]
[192,"San Juan de la Encinilla","500",1]
[193,"San Juan de la Nava","500",1]
[194,"San Juan del Molinillo","500",1]
[195,"San Juan del Olmo","500",1]
[196,"San Lorenzo de Tormes","500",1]
[197,"San Martín de la Vega del Alberche","500",1]
[198,"San Martín del Pimpollar","500",1]
[199,"San Miguel de Corneja","500",1]
[200,"San Miguel de Serrezuela","500",1]
[201,"San Pascual","500",1]
[202,"San Pedro del Arroyo","550",1]
[203,"San Vicente de Arévalo","500",1]
[204,"Sanchidrián","550",1]
[205,"Sanchorreja","500",1]
[206,"Santa Cruz de Pinares","550",1]
[207,"Santa Cruz del Valle","550",1]
[208,"Santa María de los Caballeros","500",1]
[209,"Santa María del Arroyo","500",1]
[210,"Santa María del Berrocal","500",1]
[211,"Santa María del Cubillo","500",1]
[212,"Santa María del Tiétar","600",1]
[213,"Santiago de Tormes","500",1]
[214,"Santiago del Collado","500",1]
[215,"Santo Domingo de las Posadas","500",1]
[216,"Santo Tomé de Zabarcos","500",1]
[217,"Serranillos","550",1]
[218,"Sigeres","500",1]
[219,"Sinlabajos","500",1]
[220,"Solana de Ávila","500",1]
[221,"Solana de Rioalmar","500",1]
[222,"Solosancho","550",1]
[223,"Sotalbo","500",1]
[224,"Sotillo de la Adrada","600",1]
[225,"Tiñosillos","500",1]
[226,"Tolbaños","500",1]
[227,"Tormellas","500",1]
[228,"Tornadizos de Ávila","500",1]
[229,"Tórtoles","500",1]
[230,"Umbrías","500",1]
[231,"Vadillo de la Sierra","500",1]
[232,"Valdecasa","500",1]
[233,"Vega de Santa María","500",1]
[234,"Velayos","500",1]
[235,"Villaflor","500",1]
[236,"Villafranca de la Sierra","500",1]
[237,"Villanueva de Ávila","500",1]
[238,"Villanueva de Gómez","500",1]
[239,"Villanueva del Aceral","500",1]
[240,"Villanueva del Campillo","500",1]
[241,"Villar de Corneja","500",1]
{"$rows_left_out":999}